Target
ATP-dependent translocase ABCB1
Ligand
BDBM25759
Substrate
Meas. Tech.
ChEMBL_838266 (CHEMBL2076214)
IC50
6000±n/a nM
Citation
 Wang, EJCasciano, CNClement, RPJohnson, WW Active transport of fluorescent P-glycoprotein substrates: evaluation as markers and interaction with inhibitors. Biochem Biophys Res Commun 289:580-5 (2001)  
Target
Name:
ATP-dependent translocase ABCB1
Synonyms:
ABCB1 MDR1_HUMAN Multidrug resistance protein 1 P-glycoprotein (P-gp) PGY1
Type:
Protein
Mol. Mass.:
141503.50
Organism:
Homo sapiens (Human)
Description:
P08183
Residue:
1280
  
Inhibitor
Name:
BDBM25759
Synonyms:
CHEMBL723 Coreg Eucardic | [3-(9H-carbazol-4-yloxy)-2-hydroxypropyl][2-(2-methoxyphenoxy)ethyl]amine
Type:
Small organic molecule
Emp. Form.:
C24H26N2O4
Mol. Mass.:
406.4742
SMILES:
COc1ccccc1OCCNCC(O)COc1cccc2[nH]c3ccccc3c12
: