Target
G-protein coupled receptor 35
Ligand
BDBM14363
Substrate
Meas. Tech.
ChEMBL_840342 (CHEMBL2089406)
EC50
5300±n/a nM
Citation
 Deng, HFang, Y Synthesis and Agonistic Activity at the GPR35 of 5,6-Dihydroxyindole-2-carboxylic Acid Analogues. ACS Med Chem Lett 3:550-554 (2012)  
Target
Name:
G-protein coupled receptor 35
Synonyms:
G protein-coupled receptor 35 GPR35_HUMAN
Type:
Enzyme Catalytic Domain
Mol. Mass.:
34085.57
Organism:
Homo sapiens (Human)
Description:
gi_33695097
Residue:
309
  
Inhibitor
Name:
BDBM14363
Synonyms:
3-(2-propoxyphenyl)-2,4,7,8,9-pentazabicyclo[4.3.0]nona-1,3,6-trien-5-one Tocris-0947 | Zaprinast
Type:
Small organic molecule
Emp. Form.:
C13H13N5O2
Mol. Mass.:
271.2746
SMILES:
CCCOc1ccccc1-c1nc2nn[nH]c2c(=O)[nH]1
: