Target
B1 bradykinin receptor
Ligand
BDBM50420581
Substrate
Meas. Tech.
ChEMBL_841721 (CHEMBL2092264)
Ki
0.2±n/a nM
Citation
 Barth, MBondoux, MLuccarini, JMPeyrou, VDodey, PPruneau, DMassardier, CPaquet, JL From bradykinin B2 receptor antagonists to orally active and selective bradykinin B1 receptor antagonists. J Med Chem 55:2574-84 (2012)  
Target
Name:
B1 bradykinin receptor
Synonyms:
B1 BRADYKININ B1R BK-1 receptor BRADYB1 | Bradykinin B1 receptor
Type:
Enzyme
Mol. Mass.:
40508.87
Organism:
Homo sapiens (Human)
Description:
P46663
Residue:
353
  
Inhibitor
Name:
BDBM50420581
Synonyms:
CHEMBL2087422
Type:
Small organic molecule
Emp. Form.:
C25H42N4O5S
Mol. Mass.:
510.69
SMILES:
CCN1CCC(CC1)N1CCN(CC1)C(=O)COCCN(C)S(=O)(=O)c1c(C)cc(OC)cc1C
: