Target
Transient receptor potential cation channel subfamily M member 8
Ligand
BDBM50420679
Substrate
Meas. Tech.
ChEMBL_842361 (CHEMBL2091978)
IC50
4800±n/a nM
Citation
 Ortar, GMorera, LMoriello, ASMorera, ENalli, MDi Marzo, VDe Petrocellis, L Modulation of thermo-transient receptor potential (thermo-TRP) channels by thymol-based compounds. Bioorg Med Chem Lett 22:3535-9 (2012)  
Target
Name:
Transient receptor potential cation channel subfamily M member 8
Synonyms:
Cmr1 Transient receptor potential M8 protein (TRPM8) Trpm8
Type:
Enzyme
Mol. Mass.:
127633.53
Organism:
Rattus norvegicus (Rat)
Description:
Q8R455
Residue:
1104
  
Inhibitor
Name:
BDBM50420679
Synonyms:
CHEMBL2087055
Type:
Small organic molecule
Emp. Form.:
C17H18ClNO
Mol. Mass.:
287.784
SMILES:
CC(C)c1ccc(C)cc1C(=O)Nc1ccc(Cl)cc1
: