Target
Transient receptor potential cation channel subfamily A member 1
Ligand
BDBM50420679
Substrate
Meas. Tech.
ChEMBL_842221 (CHEMBL2091726)
IC50
26150±n/a nM
Citation
 Ortar, GMorera, LMoriello, ASMorera, ENalli, MDi Marzo, VDe Petrocellis, L Modulation of thermo-transient receptor potential (thermo-TRP) channels by thymol-based compounds. Bioorg Med Chem Lett 22:3535-9 (2012)  
Target
Name:
Transient receptor potential cation channel subfamily A member 1
Synonyms:
Anktm1 Trpa1
Type:
PROTEIN
Mol. Mass.:
128622.74
Organism:
Rattus norvegicus
Description:
ChEMBL_1450487
Residue:
1125
  
Inhibitor
Name:
BDBM50420679
Synonyms:
CHEMBL2087055
Type:
Small organic molecule
Emp. Form.:
C17H18ClNO
Mol. Mass.:
287.784
SMILES:
CC(C)c1ccc(C)cc1C(=O)Nc1ccc(Cl)cc1
: