Target
Translocator protein
Ligand
BDBM50421096
Substrate
Meas. Tech.
ChEMBL_842489 (CHEMBL2092214)
Ki
1.6±n/a nM
Citation
 Fukaya, TKodo, TIshiyama, TKakuyama, HNishikawa, HBaba, SMasumoto, S Design, synthesis and structure-activity relationships of novel benzoxazolone derivatives as 18 kDa translocator protein (TSPO) ligands. Bioorg Med Chem 20:5568-82 (2012)  
Target
Name:
Translocator protein
Synonyms:
Benzodiazepine receptors; peripheral & central Mbr PBR Peripheral benzodiazepine receptor (PBR) TSPO_RAT | Tspo
Type:
Mitochondrion membrane protein
Mol. Mass.:
18945.84
Organism:
Rattus norvegicus (rat)
Description:
Competitive binding experiments were performed on rat kidney mitochondrial membranes.
Residue:
169
  
Inhibitor
Name:
BDBM50421096
Synonyms:
CHEMBL2088346
Type:
Small organic molecule
Emp. Form.:
C22H18N2O3
Mol. Mass.:
358.3899
SMILES:
CN(C(=O)Cn1c2cc(ccc2oc1=O)-c1ccccc1)c1ccccc1
: