Target
Motilin receptor
Ligand
BDBM50344942
Substrate
Meas. Tech.
ChEMBL_122665 (CHEMBL732795)
pH
2.5±n/a
IC50
71±n/a nM
Comments
extracted
Citation
  TBA Bioorg Med Chem Lett 5:835-838 (1995)    Article 
Target
Name:
Motilin receptor
Synonyms:
G-protein coupled receptor 38 MLNR MTLR1 | MTLR_HUMAN
Type:
PROTEIN
Mol. Mass.:
45365.95
Organism:
Homo sapiens (Human)
Description:
ChEMBL_122664
Residue:
412
  
Inhibitor
Name:
BDBM50344942
Synonyms:
CHEMBL532 ERYTHROMYCIN Erycette Erythromycin A Ilotycin | T-Stat
Type:
Small organic molecule
Emp. Form.:
C37H67NO13
Mol. Mass.:
733.9268
SMILES:
CC[C@H]1OC(=O)[C@H](C)[C@@H](O[C@H]2C[C@@](C)(OC)[C@@H](O)[C@H](C)O2)[C@H](C)[C@@H](O[C@@H]2O[C@H](C)C[C@@H]([C@H]2O)N(C)C)[C@](C)(O)C[C@@H](C)C(=O)[C@H](C)[C@@H](O)[C@]1(C)O
: