Target
Integrin alpha-4/beta-1
Ligand
BDBM50110103
Substrate
Meas. Tech.
ChEMBL_214679 (CHEMBL818285)
IC50
8.1±n/a nM
Citation
 de Laszlo, SELi, BMcCauley, EVan Riper, GHagmann, WK Identification of unique VLA-4 antagonists from a combinatorial library. Bioorg Med Chem Lett 12:685-8 (2002)  
Target
Name:
Integrin alpha-4/beta-1
Synonyms:
Fibronectin receptor beta/Integrin alpha-4 | Integrin alpha-4/beta-1
Type:
Mol. Mass.:
Description:
ASSAY_ID of EBI is 88912
Components:
This complex has 2 components.
Component 1
Name:
Integrin beta-1
Synonyms:
CD_antigen=CD29 Fibronectin receptor beta GPIIA ITGB1 MDF2 | MSK12
Type:
Enzyme
Mol. Mass.:
88400.38
Organism:
Homo sapiens (Human)
Description:
P05556
Residue:
798
  
Component 2
Name:
Integrin alpha-4
Synonyms:
CD49 antigen-like family member D CD49d antigen ITA4_HUMAN Integrin alpha-4 Integrin alpha-IV VLA-4 integrin alpha 4 precursor | integrin alpha-4 precursor
Type:
Membrane Protein
Mol. Mass.:
114897.35
Organism:
Homo sapiens (Human)
Description:
P13612
Residue:
1032
  
Inhibitor
Name:
BDBM50110103
Synonyms:
(S)-3-Phenyl-2-[(1-phenyl-4-{2-[4-(3-o-tolyl-ureido)-phenyl]-acetyl}-cyclohexanecarbonyl)-amino]-propionic acid | CHEMBL435459
Type:
Small organic molecule
Emp. Form.:
C38H39N3O5
Mol. Mass.:
617.7334
SMILES:
Cc1ccccc1NC(=O)Nc1ccc(CC(=O)C2CCC(CC2)(C(=O)N[C@@H](Cc2ccccc2)C(O)=O)c2ccccc2)cc1
: