Target
Integrin alpha-4/beta-1
Ligand
BDBM50105400
Substrate
Meas. Tech.
ChEMBL_214679 (CHEMBL818285)
IC50
0.530000±n/a nM
Citation
 de Laszlo, SELi, BMcCauley, EVan Riper, GHagmann, WK Identification of unique VLA-4 antagonists from a combinatorial library. Bioorg Med Chem Lett 12:685-8 (2002)  
Target
Name:
Integrin alpha-4/beta-1
Synonyms:
Fibronectin receptor beta/Integrin alpha-4 | Integrin alpha-4/beta-1
Type:
Mol. Mass.:
Description:
ASSAY_ID of EBI is 88912
Components:
This complex has 2 components.
Component 1
Name:
Integrin beta-1
Synonyms:
CD_antigen=CD29 Fibronectin receptor beta GPIIA ITGB1 MDF2 | MSK12
Type:
Enzyme
Mol. Mass.:
88400.38
Organism:
Homo sapiens (Human)
Description:
P05556
Residue:
798
  
Component 2
Name:
Integrin alpha-4
Synonyms:
CD49 antigen-like family member D CD49d antigen ITA4_HUMAN Integrin alpha-4 Integrin alpha-IV VLA-4 integrin alpha 4 precursor | integrin alpha-4 precursor
Type:
Membrane Protein
Mol. Mass.:
114897.35
Organism:
Homo sapiens (Human)
Description:
P13612
Residue:
1032
  
Inhibitor
Name:
BDBM50105400
Synonyms:
(S)-2-{[(S)-2-(3,4-Dimethoxy-benzenesulfonyl)-1,2,3,4-tetrahydro-isoquinoline-3-carbonyl]-amino}-hexanoic acid | CHEMBL89960
Type:
Small organic molecule
Emp. Form.:
C24H30N2O7S
Mol. Mass.:
490.569
SMILES:
CCCC[C@H](NC(=O)[C@@H]1Cc2ccccc2CN1S(=O)(=O)c1ccc(OC)c(OC)c1)C(O)=O
: