Target
Beta-2 adrenergic receptor
Ligand
BDBM50421726
Substrate
Meas. Tech.
ChEMBL_37826 (CHEMBL653458)
Kd
50±n/a nM
Citation
 IJzerman, APAué, GHBultsma, TLinschoten, MRTimmerman, H Quantitative evaluation of the beta 2-adrenoceptor affinity of phenoxypropanolamines and phenylethanolamines. J Med Chem 28:1328-34 (1985)  
Target
Name:
Beta-2 adrenergic receptor
Synonyms:
ADRB2 Beta-2 adrenergic receptor Beta-2 adrenoreceptor | adrenergic Beta
Type:
Enzyme Catalytic Domain
Mol. Mass.:
47141.18
Organism:
BOVINE
Description:
adrenergic Beta ADRB2 BOVINE::Q28044
Residue:
418
  
Inhibitor
Name:
BDBM50421726
Synonyms:
CHEMBL1159891
Type:
Small organic molecule
Emp. Form.:
C13H21NO3
Mol. Mass.:
239.3107
SMILES:
CC(C)NCC(O)COc1ccccc1CO
: