Target
Beta-2 adrenergic receptor
Ligand
BDBM50421721
Substrate
Meas. Tech.
ChEMBL_37818 (CHEMBL651193)
Kd
263±n/a nM
Citation
 IJzerman, APAué, GHBultsma, TLinschoten, MRTimmerman, H Quantitative evaluation of the beta 2-adrenoceptor affinity of phenoxypropanolamines and phenylethanolamines. J Med Chem 28:1328-34 (1985)  
Target
Name:
Beta-2 adrenergic receptor
Synonyms:
ADRB2 Beta-2 adrenergic receptor Beta-2 adrenoreceptor | adrenergic Beta
Type:
Enzyme Catalytic Domain
Mol. Mass.:
47141.18
Organism:
BOVINE
Description:
adrenergic Beta ADRB2 BOVINE::Q28044
Residue:
418
  
Inhibitor
Name:
BDBM50421721
Synonyms:
CHEMBL1159712 | SKF-56301
Type:
Small organic molecule
Emp. Form.:
C13H22N2O2
Mol. Mass.:
238.326
SMILES:
CNc1cc(ccc1O)C(O)CNC(C)(C)C
: