Target
Beta-2 adrenergic receptor
Ligand
BDBM25760
Substrate
Meas. Tech.
ChEMBL_37818 (CHEMBL651193)
Kd
79±n/a nM
Citation
 IJzerman, APAué, GHBultsma, TLinschoten, MRTimmerman, H Quantitative evaluation of the beta 2-adrenoceptor affinity of phenoxypropanolamines and phenylethanolamines. J Med Chem 28:1328-34 (1985)  
Target
Name:
Beta-2 adrenergic receptor
Synonyms:
ADRB2 Beta-2 adrenergic receptor Beta-2 adrenoreceptor | adrenergic Beta
Type:
Enzyme Catalytic Domain
Mol. Mass.:
47141.18
Organism:
BOVINE
Description:
adrenergic Beta ADRB2 BOVINE::Q28044
Residue:
418
  
Inhibitor
Name:
BDBM25760
Synonyms:
1-(naphthalen-2-yl)-2-(propan-2-ylamino)ethan-1-ol Pronetalol | Pronethalol
Type:
Small organic molecule
Emp. Form.:
C15H19NO
Mol. Mass.:
229.3175
SMILES:
CC(C)NCC(O)c1ccc2ccccc2c1
: