Target
Beta-2 adrenergic receptor
Ligand
BDBM92679
Substrate
Meas. Tech.
ChEMBL_37826 (CHEMBL653458)
Kd
910±n/a nM
Citation
 IJzerman, APAué, GHBultsma, TLinschoten, MRTimmerman, H Quantitative evaluation of the beta 2-adrenoceptor affinity of phenoxypropanolamines and phenylethanolamines. J Med Chem 28:1328-34 (1985)  
Target
Name:
Beta-2 adrenergic receptor
Synonyms:
ADRB2 Beta-2 adrenergic receptor Beta-2 adrenoreceptor | adrenergic Beta
Type:
Enzyme Catalytic Domain
Mol. Mass.:
47141.18
Organism:
BOVINE
Description:
adrenergic Beta ADRB2 BOVINE::Q28044
Residue:
418
  
Inhibitor
Name:
BDBM92679
Synonyms:
3-{1-hydroxy-2-[(propan-2-yl)amino]ethyl}phenol, 7
Type:
Small molecule
Emp. Form.:
C11H17NO2
Mol. Mass.:
195.2582
SMILES:
CC(C)NCC(O)c1cccc(O)c1
: