Target
Beta-2 adrenergic receptor
Ligand
BDBM81447
Substrate
Meas. Tech.
ChEMBL_37818 (CHEMBL651193)
Kd
0.630957±n/a nM
Citation
 IJzerman, APAué, GHBultsma, TLinschoten, MRTimmerman, H Quantitative evaluation of the beta 2-adrenoceptor affinity of phenoxypropanolamines and phenylethanolamines. J Med Chem 28:1328-34 (1985)  
Target
Name:
Beta-2 adrenergic receptor
Synonyms:
ADRB2 Beta-2 adrenergic receptor Beta-2 adrenoreceptor | adrenergic Beta
Type:
Enzyme Catalytic Domain
Mol. Mass.:
47141.18
Organism:
BOVINE
Description:
adrenergic Beta ADRB2 BOVINE::Q28044
Residue:
418
  
Inhibitor
Name:
BDBM81447
Synonyms:
CAS_43216 NSC_43216
Type:
Small organic molecule
Emp. Form.:
C15H25NO2
Mol. Mass.:
251.3645
SMILES:
CCCc1ccccc1OCC(O)CNC(C)C
: