Target
Beta-2 adrenergic receptor
Ligand
BDBM50405521
Substrate
Meas. Tech.
ChEMBL_37818 (CHEMBL651193)
Kd
93±n/a nM
Citation
 IJzerman, APAué, GHBultsma, TLinschoten, MRTimmerman, H Quantitative evaluation of the beta 2-adrenoceptor affinity of phenoxypropanolamines and phenylethanolamines. J Med Chem 28:1328-34 (1985)  
Target
Name:
Beta-2 adrenergic receptor
Synonyms:
ADRB2 Beta-2 adrenergic receptor Beta-2 adrenoreceptor | adrenergic Beta
Type:
Enzyme Catalytic Domain
Mol. Mass.:
47141.18
Organism:
BOVINE
Description:
adrenergic Beta ADRB2 BOVINE::Q28044
Residue:
418
  
Inhibitor
Name:
BDBM50405521
Synonyms:
ALO 1401-02 BETAXOLOL HYDROCHLORIDE | Betaxolol
Type:
Small organic molecule
Emp. Form.:
C18H29NO3
Mol. Mass.:
307.4278
SMILES:
CC(C)NCC(O)COc1ccc(CCOCC2CC2)cc1
: