Target
Beta-2 adrenergic receptor
Ligand
BDBM50421733
Substrate
Meas. Tech.
ChEMBL_37818 (CHEMBL651193)
Kd
631±n/a nM
Citation
 IJzerman, APAué, GHBultsma, TLinschoten, MRTimmerman, H Quantitative evaluation of the beta 2-adrenoceptor affinity of phenoxypropanolamines and phenylethanolamines. J Med Chem 28:1328-34 (1985)  
Target
Name:
Beta-2 adrenergic receptor
Synonyms:
ADRB2 Beta-2 adrenergic receptor Beta-2 adrenoreceptor | adrenergic Beta
Type:
Enzyme Catalytic Domain
Mol. Mass.:
47141.18
Organism:
BOVINE
Description:
adrenergic Beta ADRB2 BOVINE::Q28044
Residue:
418
  
Inhibitor
Name:
BDBM50421733
Synonyms:
CHEMBL1159887
Type:
Small organic molecule
Emp. Form.:
C12H19NO2
Mol. Mass.:
209.2848
SMILES:
CC(C)(C)NCC(O)c1ccc(O)cc1
: