Target
Beta-2 adrenergic receptor
Ligand
BDBM50421719
Substrate
Meas. Tech.
ChEBML_37826
Kd
10±n/a nM
Citation
 IJzerman, APAué, GHBultsma, TLinschoten, MRTimmerman, H Quantitative evaluation of the beta 2-adrenoceptor affinity of phenoxypropanolamines and phenylethanolamines. J Med Chem 28:1328-34 (1985)  
Target
Name:
Beta-2 adrenergic receptor
Synonyms:
ADRB2 Beta-2 adrenergic receptor Beta-2 adrenoreceptor | adrenergic Beta
Type:
Enzyme Catalytic Domain
Mol. Mass.:
47141.18
Organism:
BOVINE
Description:
adrenergic Beta ADRB2 BOVINE::Q28044
Residue:
418
  
Inhibitor
Name:
BDBM50421719
Synonyms:
CHEMBL1159714 | Ko 707
Type:
Small organic molecule
Emp. Form.:
C14H23NO2
Mol. Mass.:
237.3379
SMILES:
CC(C)NCC(O)COc1cc(C)cc(C)c1
: