Target
Beta-2 adrenergic receptor
Ligand
BDBM50241366
Substrate
Meas. Tech.
ChEBML_37826
Kd
43.7±n/a nM
Citation
 IJzerman, APAué, GHBultsma, TLinschoten, MRTimmerman, H Quantitative evaluation of the beta 2-adrenoceptor affinity of phenoxypropanolamines and phenylethanolamines. J Med Chem 28:1328-34 (1985)  
Target
Name:
Beta-2 adrenergic receptor
Synonyms:
ADRB2 Beta-2 adrenergic receptor Beta-2 adrenoreceptor | adrenergic Beta
Type:
Enzyme Catalytic Domain
Mol. Mass.:
47141.18
Organism:
BOVINE
Description:
adrenergic Beta ADRB2 BOVINE::Q28044
Residue:
418
  
Inhibitor
Name:
BDBM50241366
Synonyms:
(S)-1-(isopropylamino)-3-(m-tolyloxy)propan-2-ol CHEMBL252319
Type:
Small organic molecule
Emp. Form.:
C13H21NO2
Mol. Mass.:
223.3113
SMILES:
CC(C)NC[C@H](O)COc1cccc(C)c1
: