Target
Sigma non-opioid intracellular receptor 1
Ligand
BDBM50421935
Substrate
Meas. Tech.
ChEBML_201732
IC50
4.8±n/a nM
Citation
 Chambers, MSBaker, RBillington, DCKnight, AKMiddlemiss, DNWong, EH Spiropiperidines as high-affinity, selective sigma ligands. J Med Chem 35:2033-9 (1992)  
Target
Name:
Sigma non-opioid intracellular receptor 1
Synonyms:
Aging-associated gene 8 protein SGMR1_HUMAN SIGMAR1 SR31747-binding protein Sigma 1-type opioid receptor Sigma1R | hSigmaR1
Type:
Enzyme Catalytic Domain
Mol. Mass.:
25124.85
Organism:
Homo sapiens (Human)
Description:
Q99720
Residue:
223
  
Inhibitor
Name:
BDBM50421935
Synonyms:
CHEMBL1744010
Type:
Small organic molecule
Emp. Form.:
C19H29N
Mol. Mass.:
271.4403
SMILES:
CCCCN1CCC2(CC1)CCCCc1ccccc21
: