Target
Acetylcholinesterase
Ligand
BDBM50079866
Substrate
Meas. Tech.
ChEMBL_307247 (CHEMBL875559)
IC50
4.5±n/a nM
Citation
 Martín-Santamaría, SMuñoz-Muriedas, JLuque, FJGago, F Modulation of binding strength in several classes of active site inhibitors of acetylcholinesterase studied by comparative binding energy analysis. J Med Chem 47:4471-82 (2004)  
Target
Name:
Acetylcholinesterase
Synonyms:
ACES_BOVIN Acetylcholinesterase (AChE) | Acetylcholinesterase precursor
Type:
Enzyme
Mol. Mass.:
67659.62
Organism:
Bos taurus (bovine)
Description:
Residue:
613
  
Inhibitor
Name:
BDBM50079866
Synonyms:
(+)-15-ethyl-7-methyl-10-azatetracyclo[11.3.1.02,11.04,9]heptadeca-2(11),3,5,7,9,14-hexaen-3-amine (rac)15-ethyl-7-methyl-10-azatetracyclo[11.3.1.02,11.04,9]heptadeca-2(11),3,5,7,9,14-hexaen-3-amine 15-ethyl-7-methyl-10-azatetracyclo[11.3.1.02,11.04,9]heptadeca-2(11),3,5,7,9,14-hexaen-3-amine rac-huprine H5
Type:
Small organic molecule
Emp. Form.:
C19H22N2
Mol. Mass.:
278.3914
SMILES:
CCC1=CC2CC(C1)c1c(C2)nc2cc(C)ccc2c1N
: