Target
Melanin-concentrating hormone receptor 1
Ligand
BDBM50422919
Substrate
Meas. Tech.
ChEMBL_391803 (CHEMBL871566)
IC50
16±n/a nM
Citation
 Carpenter, AJAl-Barazanji, KABarvian, KKBishop, MJBritt, CSCooper, JPGoetz, ASGrizzle, MKHertzog, DLIgnar, DMMorgan, ROPeckham, GESpeake, JDSwain, WR Novel benzimidazole-based MCH R1 antagonists. Bioorg Med Chem Lett 16:4994-5000 (2006)  
Target
Name:
Melanin-concentrating hormone receptor 1
Synonyms:
G-protein coupled receptor 24 MCH receptor 1 MCH-R1 MCHR-1 MCHR1_HUMAN Melanin-Concentrating Hormone Receptor 1 (MCH1R) Melanin-concentrating hormone receptor 1 (MCH-1) Melanin-concentrating hormone receptor 1 (MCHR-1) SLC-1 Somatostatin receptor-like protein
Type:
G Protein-Coupled Receptor (GPCR)
Mol. Mass.:
45976.27
Organism:
Homo sapiens (Human)
Description:
Membranes from CHO-K1 cells stably expressing human MCH1R were used in assays.
Residue:
422
  
Inhibitor
Name:
BDBM50422919
Synonyms:
CHEMBL387438
Type:
Small organic molecule
Emp. Form.:
C23H18ClN5O2S
Mol. Mass.:
463.939
SMILES:
Clc1ccc(cc1)-c1cc2ncn(-c3ccc4nc([nH]c4c3)N3CCOCC3)c(=O)c2s1
: