Target
Lanosterol synthase
Ligand
BDBM50130784
Substrate
Meas. Tech.
ChEMBL_446074 (CHEMBL895169)
IC50
7.9±n/a nM
Citation
 Caron, GErmondi, G Influence of conformation on GRIND-based three-dimensional quantitative structure-activity relationship (3D-QSAR). J Med Chem 50:5039-42 (2007)  
Target
Name:
Lanosterol synthase
Synonyms:
2,3-epoxysqualene--lanosterol cyclase LSS_HUMAN Oxidosqualene--lanosterol cyclase
Type:
PROTEIN
Mol. Mass.:
83309.32
Organism:
Homo sapiens (Human)
Description:
ChEMBL_11231
Residue:
732
  
Inhibitor
Name:
BDBM50130784
Synonyms:
Allyl-{6-[1-(4-bromo-phenyl)-3,4-dihydro-isoquinolin-6-yloxy]-hexyl}-methyl-amine N-allyl-6-(1-(4-bromophenyl)-3,4-dihydroisoquinolin-6-yloxy)-N-methylhexan-1-aminium
Type:
Small organic molecule
Emp. Form.:
C25H31BrN2O
Mol. Mass.:
455.43
SMILES:
CN(CCCCCCOc1ccc2C(=NCCc2c1)c1ccc(Br)cc1)CC=C
: