Target
Lanosterol synthase
Ligand
BDBM50128061
Substrate
Meas. Tech.
ChEMBL_446074 (CHEMBL895169)
IC50
22±n/a nM
Citation
 Caron, GErmondi, G Influence of conformation on GRIND-based three-dimensional quantitative structure-activity relationship (3D-QSAR). J Med Chem 50:5039-42 (2007)  
Target
Name:
Lanosterol synthase
Synonyms:
2,3-epoxysqualene--lanosterol cyclase LSS_HUMAN Oxidosqualene--lanosterol cyclase
Type:
PROTEIN
Mol. Mass.:
83309.32
Organism:
Homo sapiens (Human)
Description:
ChEMBL_11231
Residue:
732
  
Inhibitor
Name:
BDBM50128061
Synonyms:
(4-Bromo-phenyl)-(4-{2-[(cyclopropyl-methyl-amino)-methyl]-cyclopropylmethoxy}-phenyl)-methanone N-(((1S,2S)-2-((4-(4-bromobenzoyl)phenoxy)methyl)cyclopropyl)methyl)-N-methylcyclopropanaminium
Type:
Small organic molecule
Emp. Form.:
C22H24BrNO2
Mol. Mass.:
414.335
SMILES:
CN(C[C@H]1C[C@@H]1COc1ccc(cc1)C(=O)c1ccc(Br)cc1)C1CC1
: