Target
Matrix metalloproteinase-9
Ligand
BDBM11341
Substrate
Meas. Tech.
ChEMBL_458932 (CHEMBL924951)
Ki
1.2±n/a nM
Citation
 Verma, RPHansch, C Matrix metalloproteinases (MMPs): chemical-biological functions and (Q)SARs. Bioorg Med Chem 15:2223-68 (2007)  
Target
Name:
Matrix metalloproteinase-9
Synonyms:
67 kDa matrix metalloproteinase-9 92 kDa gelatinase CLG4B Gelatinase B MMP9 Matrix metalloproteinase 9 (MMP-9) Matrix metalloproteinase-9 (MMP9)
Type:
Enzyme
Mol. Mass.:
78452.28
Organism:
Homo sapiens (Human)
Description:
P14780
Residue:
707
  
Inhibitor
Name:
BDBM11341
Synonyms:
2-[benzyl(2,3,4,5,6-pentafluorobenzene)sulfonamido]-N-hydroxy-3-methylbutanamide | Hydroxamate 23
Type:
Small organic molecule
Emp. Form.:
C18H17F5N2O4S
Mol. Mass.:
452.396
SMILES:
CC(C)C(N(Cc1ccccc1)S(=O)(=O)c1c(F)c(F)c(F)c(F)c1F)C(=O)NO
: