Target
Stromelysin-1
Ligand
BDBM50082535
Substrate
Meas. Tech.
ChEMBL_458939 (CHEMBL924958)
IC50
11±n/a nM
Citation
 Verma, RPHansch, C Matrix metalloproteinases (MMPs): chemical-biological functions and (Q)SARs. Bioorg Med Chem 15:2223-68 (2007)  
Target
Name:
Stromelysin-1
Synonyms:
MMP-3 MMP3_HUMAN Matrix metalloproteinase 3 Matrix metalloproteinase-3 (MMP-3) SL-1 Stromelysin 1 | Transin-1
Type:
Enzyme
Mol. Mass.:
53973.13
Organism:
Homo sapiens (Human)
Description:
P08254
Residue:
477
  
Inhibitor
Name:
BDBM50082535
Synonyms:
(S)-2,2-Dimethyl-4-(4-phenoxy-benzenesulfonyl)-[1,4]thiazepane-3-carboxylic acid hydroxyamide CHEMBL140569
Type:
Small organic molecule
Emp. Form.:
C20H24N2O5S2
Mol. Mass.:
436.545
SMILES:
CC1(C)SCCCN([C@H]1C(=O)NO)S(=O)(=O)c1ccc(Oc2ccccc2)cc1
: