Target
Cysteine synthase
Ligand
BDBM50423709
Substrate
Meas. Tech.
ChEMBL_596272 (CHEMBL1050688)
Kd
25119±n/a nM
Citation
 Salsi, EBayden, ASSpyrakis, FAmadasi, ACampanini, BBettati, SDodatko, TCozzini, PKellogg, GECook, PFRoderick, SLMozzarelli, A Design of O-acetylserine sulfhydrylase inhibitors by mimicking nature. J Med Chem 53:345-56 (2010)  
Target
Name:
Cysteine synthase
Synonyms:
CSase O-acetylserine (thiol)-lyase cysK
Type:
PROTEIN
Mol. Mass.:
33385.00
Organism:
Haemophilus influenzae (strain ATCC 51907 / DSM 11121 / KW20 / Rd)
Description:
ChEMBL_596272
Residue:
316
  
Inhibitor
Name:
BDBM50423709
Synonyms:
CHEMBL568900
Type:
Small organic molecule
Emp. Form.:
C30H44N8O8S
Mol. Mass.:
676.784
SMILES:
CC[C@H](C)[C@H](NC(=O)[C@H](CC(N)=O)NC(=O)[C@H](Cc1c[nH]c2ccccc12)NC(=O)[C@H](CC(N)=O)NC(=O)[C@@H](N)CCSC)C(O)=O
: