Target
Beta-2 adrenergic receptor
Ligand
BDBM50423826
Substrate
Meas. Tech.
ChEMBL_770402 (CHEMBL1833711)
Kd
0.436516±n/a nM
Citation
 Baker, JGAdams, LASalchow, KMistry, SNMiddleton, RJHill, SJKellam, B Synthesis and characterization of high-affinity 4,4-difluoro-4-bora-3a,4a-diaza-s-indacene-labeled fluorescent ligands for humanß-adrenoceptors. J Med Chem 54:6874-87 (2011)  
Target
Name:
Beta-2 adrenergic receptor
Synonyms:
ADRB2 ADRB2_HUMAN Beta-2 adrenoceptor | Beta-2 adrenoreceptor
Type:
Mol. Mass.:
46461.69
Organism:
Homo sapiens (Human)
Description:
P07550
Residue:
413
  
Inhibitor
Name:
BDBM50423826
Synonyms:
CHEMBL1830492
Type:
Small organic molecule
Emp. Form.:
C48H54BF2N5O7S
Mol. Mass.:
893.844
SMILES:
OC(CNCCOCCOCCNC(=O)CCCCCNC(=O)COc1ccc(\C=C\c2ccc3C=C4C=CC(c5cccs5)=[N+]4[B-](F)(F)n23)cc1)COc1cccc2ccccc12
: