Target
Tyrosine-protein phosphatase non-receptor type 1
Ligand
BDBM50423986
Substrate
Meas. Tech.
ChEMBL_935597 (CHEMBL2320379)
IC50
>50000±n/a nM
Citation
 Zhang, XSBi, XLWan-Xiao, naCao, JQXia, XCDiao, YPZhao, YQ Protein tyrosine phosphatase 1B inhibitory effect by dammarane-type triterpenes from hydrolyzate of total Gynostemma pentaphyllum saponins. Bioorg Med Chem Lett 23:297-300 (2012)  
Target
Name:
Tyrosine-protein phosphatase non-receptor type 1
Synonyms:
PTN1_HUMAN PTPN1 Protein tyrosine phosphatase-1B (PTP1B) Protein-tyrosine phosphatase 1B (PTP1B) Tyrosine-protein phosphatase non-receptor type 1 (PTP1B)
Type:
Protein phosphatase
Mol. Mass.:
49963.76
Organism:
Homo sapiens (Human)
Description:
Human recombinant GST-fusion PTP1B (1-435).
Residue:
435
  
Inhibitor
Name:
BDBM50423986
Synonyms:
GYPENSAPOGENIN D
Type:
Small organic molecule
Emp. Form.:
C30H46O3
Mol. Mass.:
454.6844
SMILES:
[#6]\[#6](-[#6])=[#6]\[#6@@H]-1-[#8]-[#6](=O)-[#6](=[#6]1)-[#6@H]-1-[#6]-[#6][C@]2([#6])[#6@@H]-1-[#6]-[#6]-[#6@@H]1[C@@]3([#6])[#6]-[#6]-[#6@H](-[#8])C([#6])([#6])[#6@@H]3-[#6]-[#6][C@@]21[#6]
: