Target
Tyrosine-protein phosphatase non-receptor type 1
Ligand
BDBM50115732
Substrate
Meas. Tech.
ChEMBL_935597 (CHEMBL2320379)
IC50
22000±n/a nM
Citation
 Zhang, XSBi, XLWan-Xiao, naCao, JQXia, XCDiao, YPZhao, YQ Protein tyrosine phosphatase 1B inhibitory effect by dammarane-type triterpenes from hydrolyzate of total Gynostemma pentaphyllum saponins. Bioorg Med Chem Lett 23:297-300 (2012)  
Target
Name:
Tyrosine-protein phosphatase non-receptor type 1
Synonyms:
PTN1_HUMAN PTPN1 Protein tyrosine phosphatase-1B (PTP1B) Protein-tyrosine phosphatase 1B (PTP1B) Tyrosine-protein phosphatase non-receptor type 1 (PTP1B)
Type:
Protein phosphatase
Mol. Mass.:
49963.76
Organism:
Homo sapiens (Human)
Description:
Human recombinant GST-fusion PTP1B (1-435).
Residue:
435
  
Inhibitor
Name:
BDBM50115732
Synonyms:
CHEMBL294467 | Sodium vanadate
Type:
Small organic molecule
Emp. Form.:
O3V
Mol. Mass.:
98.9402
SMILES:
[O-][V](=O)=O
: