Target
Multidrug and toxin extrusion protein 2
Ligand
BDBM50008935
Substrate
Meas. Tech.
ChEMBL_934318 (CHEMBL2320304)
IC50
8600±n/a nM
Citation
 Wittwer, MBZur, AAKhuri, NKido, YKosaka, AZhang, XMorrissey, KMSali, AHuang, YGiacomini, KM Discovery of potent, selective multidrug and toxin extrusion transporter 1 (MATE1, SLC47A1) inhibitors through prescription drug profiling and computational modeling. J Med Chem 56:781-95 (2013)  
Target
Name:
Multidrug and toxin extrusion protein 2
Synonyms:
Kidney-specific H(+)/organic cation antiporter MATE2 SLC47A2 hMATE-2
Type:
PROTEIN
Mol. Mass.:
65098.38
Organism:
Homo sapiens (Human)
Description:
ChEMBL_934314
Residue:
602
  
Inhibitor
Name:
BDBM50008935
Synonyms:
(20S)-10-Dimethylaminomethyl-4-ethyl-4,9-dihydroxy-1,12-dihydro-4H-2-oxa-6,12a-diaza-dibenzo[b,h]fluorene-3,13-dione (S)-10-[(DIMETHYLAMINO)METHYL]-4-ETHYL-4,9-DIHYDROXY-1H-PYRANO[3'',4'':6,7]INOLIZINO[1,2-B]-QUINOLINE-3,14(4H,12H)-DIONE (S)-11-Dimethylaminomethyl-4-ethyl-4,9-dihydroxy-1,12-dihydro-4H-2-oxa-6,12a-diaza-dibenzo[b,h]fluorene-3,13-dione 10-Dimethylaminomethyl-4-ethyl-4,9-dihydroxy-1,12-dihydro-4H-2-oxa-6,12a-diaza-dibenzo[b,h]fluorene-3,13-dione (Topotecan) 10-dimethylaminomethyl-4-ethyl-4,9-dihydroxy-(4S)-3,4,12,14-tetrahydro-1H-pyrano[3'',4'':6,7]indolizino[1,2-b]quinoline-3,14-dione Hycamtin TOPOTECAN HYDROCHLORIDE | cid_60700
Type:
Small organic molecule
Emp. Form.:
C23H23N3O5
Mol. Mass.:
421.4458
SMILES:
CC[C@@]1(O)C(=O)OCc2c1cc1-c3nc4ccc(O)c(CN(C)C)c4cc3Cn1c2=O
: