Target
Cathepsin B
Ligand
BDBM64987
Substrate
Meas. Tech.
ChEMBL_936328 (CHEMBL2321260)
Ki
154400±n/a nM
Citation
 Sosic, IMirkovic, BArenz, KStefane, BKos, JGobec, S Development of new cathepsin B inhibitors: combining bioisosteric replacements and structure-based design to explore the structure-activity relationships of nitroxoline derivatives. J Med Chem 56:521-33 (2013)  
Target
Name:
Cathepsin B
Synonyms:
APP secretase CATB_HUMAN CTSB Cathepsin B light chain | Cathepsin B1
Type:
Enzyme
Mol. Mass.:
37819.69
Organism:
Homo sapiens (Human)
Description:
gi_63102437
Residue:
339
  
Inhibitor
Name:
BDBM64987
Synonyms:
5-nitro-8-quinolinol 8-HYDROXY-5-NITROQUINOLINE SMR000059036 nitroxoline
Type:
Small organic molecule
Emp. Form.:
C9H6N2O3
Mol. Mass.:
190.1555
SMILES:
Oc1ccc([N+]([O-])=O)c2cccnc12
: