Target
cGMP-dependent 3',5'-cyclic phosphodiesterase
Ligand
BDBM50425143
Substrate
Meas. Tech.
ChEMBL_936843 (CHEMBL2320477)
IC50
0.600000±n/a nM
Citation
 Andrés, JIBuijnsters, PDe Angelis, MLanglois, XRombouts, FTrabanco, AAVanhoof, G Discovery of a new series of [1,2,4]triazolo[4,3-a]quinoxalines as dual phosphodiesterase 2/phosphodiesterase 10 (PDE2/PDE10) inhibitors. Bioorg Med Chem Lett 23:785-90 (2013)  
Target
Name:
cGMP-dependent 3',5'-cyclic phosphodiesterase
Synonyms:
CGS-PDE Homo sapiens phosphodiesterase 2A (PDE2A) PDE2A cGSPDE
Type:
Enzyme Catalytic Domain
Mol. Mass.:
105691.58
Organism:
Homo sapiens (Human)
Description:
O00408
Residue:
941
  
Inhibitor
Name:
BDBM50425143
Synonyms:
CHEMBL2313247 | US11419874, Example 11
Type:
Small organic molecule
Emp. Form.:
C19H16ClN5O
Mol. Mass.:
365.816
SMILES:
CCNC(=O)c1ccc2nc(C)c3nnc(-c4ccccc4Cl)n3c2c1
: