Target
Leukotriene A-4 hydrolase
Ligand
BDBM50425157
Substrate
Meas. Tech.
ChEMBL_936844 (CHEMBL2320478)
IC50
7.3±n/a nM
Citation
 Eccles, WBlevitt, JMBooker, JNChrovian, CCCrawford, Sde Leon, ARDeng, XFourie, AMGrice, CAHerman, KKarlsson, LKearney, AMLee-Dutra, ALiang, JLuna, RPippel, DRao, NRiley, JPSantillán, ASavall, BTanis, VMXue, XYoung, AL Identification of benzofuran central cores for the inhibition of leukotriene A(4) hydrolase. Bioorg Med Chem Lett 23:811-5 (2013)  
Target
Name:
Leukotriene A-4 hydrolase
Synonyms:
LKHA4_HUMAN LTA4 Leukotriene A(4) hydrolase Leukotriene A4 hydrolase
Type:
Hydrolase; metalloprotease
Mol. Mass.:
69280.41
Organism:
Homo sapiens (Human)
Description:
Human recombinant LTA4H.
Residue:
611
  
Inhibitor
Name:
BDBM50425157
Synonyms:
CHEMBL2313272
Type:
Small organic molecule
Emp. Form.:
C22H20N4O3S
Mol. Mass.:
420.484
SMILES:
CC(=O)N1CC2CC1CN2Cc1coc2cc(Oc3nc4ncccc4s3)ccc12
: