Target
Leukotriene A-4 hydrolase
Ligand
BDBM50425167
Substrate
Meas. Tech.
ChEMBL_936852 (CHEMBL2320734)
IC50
69±n/a nM
Citation
 Eccles, WBlevitt, JMBooker, JNChrovian, CCCrawford, Sde Leon, ARDeng, XFourie, AMGrice, CAHerman, KKarlsson, LKearney, AMLee-Dutra, ALiang, JLuna, RPippel, DRao, NRiley, JPSantillán, ASavall, BTanis, VMXue, XYoung, AL Identification of benzofuran central cores for the inhibition of leukotriene A(4) hydrolase. Bioorg Med Chem Lett 23:811-5 (2013)  
Target
Name:
Leukotriene A-4 hydrolase
Synonyms:
LKHA4_MOUSE Lta4h
Type:
PROTEIN
Mol. Mass.:
69048.58
Organism:
Mus musculus
Description:
ChEMBL_936852
Residue:
611
  
Inhibitor
Name:
BDBM50425167
Synonyms:
CHEMBL2313572
Type:
Small organic molecule
Emp. Form.:
C25H25N3O3S
Mol. Mass.:
447.549
SMILES:
CC(=O)N[C@@H]1C[C@@H]2CC[C@H](C1)N2Cc1coc2cc(Oc3nc4ccccc4s3)ccc12
: