Target
Rap guanine nucleotide exchange factor 4
Ligand
BDBM50425550
Substrate
Meas. Tech.
ChEMBL_936073 (CHEMBL2319315)
IC50
1900±n/a nM
Citation
 Chen, HTsalkova, TChepurny, OGMei, FCHolz, GGCheng, XZhou, J Identification and characterization of small molecules as potent and specific EPAC2 antagonists. J Med Chem 56:952-62 (2013)  
Target
Name:
Rap guanine nucleotide exchange factor 4
Synonyms:
CGEF2 EPAC2 Exchange protein directly activated by cAMP 2 RPGF4_HUMAN cAMP-regulated guanine nucleotide exchange factor II
Type:
PROTEIN
Mol. Mass.:
115526.83
Organism:
Homo sapiens (Human)
Description:
ChEMBL_1504794
Residue:
1011
  
Inhibitor
Name:
BDBM50425550
Synonyms:
CHEMBL2313658
Type:
Small organic molecule
Emp. Form.:
C16H18O3S
Mol. Mass.:
290.377
SMILES:
COc1ccc(cc1)S(=O)(=O)c1c(C)cc(C)cc1C
: