Target
Monoglyceride lipase
Ligand
BDBM50425560
Substrate
Meas. Tech.
ChEMBL_936102 (CHEMBL2319595)
Temperature
298.15±n/a K
IC50
18960±n/a nM
Comments
extracted
Citation
 Feledziak, MMichaux, CLambert, DMMarchand-Brynaert, J An unprecedented reversible mode of action ofß-lactams for the inhibition of human fatty acid amide hydrolase (hFAAH). Eur J Med Chem 60:101-11 (2013)  
Target
Name:
Monoglyceride lipase
Synonyms:
HU-K5 Lysophospholipase-like MGL MGLL_HUMAN
Type:
Hydrolase
Mol. Mass.:
33264.56
Organism:
Homo sapiens (Human)
Description:
Human recombinant MGL (Cayman Chemical, cat# 10008354).
Residue:
303
  
Inhibitor
Name:
BDBM50425560
Synonyms:
CHEMBL2313951
Type:
Small organic molecule
Emp. Form.:
C19H25NO4S
Mol. Mass.:
363.471
SMILES:
CCCSC(=O)N1C[C@@H]([C@@H](C)OC(=O)CCCc2ccccc2)C1=O
: