Target
Fatty-acid amide hydrolase 1
Ligand
BDBM50425560
Substrate
Meas. Tech.
ChEMBL_936103 (CHEMBL2319596)
IC50
12±n/a nM
Citation
 Feledziak, MMichaux, CLambert, DMMarchand-Brynaert, J An unprecedented reversible mode of action ofß-lactams for the inhibition of human fatty acid amide hydrolase (hFAAH). Eur J Med Chem 60:101-11 (2013)  
Target
Name:
Fatty-acid amide hydrolase 1
Synonyms:
Anandamide amidohydrolase FAAH FAAH1_HUMAN Fatty-acid amide hydrolase (FAAH) Oleamide hydrolase 1
Type:
Protein
Mol. Mass.:
63071.19
Organism:
Homo sapiens (Human)
Description:
O00519
Residue:
579
  
Inhibitor
Name:
BDBM50425560
Synonyms:
CHEMBL2313951
Type:
Small organic molecule
Emp. Form.:
C19H25NO4S
Mol. Mass.:
363.471
SMILES:
CCCSC(=O)N1C[C@@H]([C@@H](C)OC(=O)CCCc2ccccc2)C1=O
: