Target
Muscarinic acetylcholine receptor M5
Ligand
BDBM50426269
Substrate
Meas. Tech.
ChEMBL_936414 (CHEMBL2317407)
Ki
370±n/a nM
Citation
 Zheng, GSmith, AMHuang, XSubramanian, KLSiripurapu, KBDeaciuc, AZhan, CGDwoskin, LP Structural modifications to tetrahydropyridine-3-carboxylate esters en route to the discovery of M5-preferring muscarinic receptor orthosteric antagonists. J Med Chem 56:1693-703 (2013)  
Target
Name:
Muscarinic acetylcholine receptor M5
Synonyms:
ACM5_HUMAN | CHRM5
Type:
PROTEIN
Mol. Mass.:
60102.35
Organism:
Homo sapiens (Human)
Description:
ChEMBL_1517990
Residue:
532
  
Inhibitor
Name:
BDBM50426269
Synonyms:
CHEMBL2312373
Type:
Small organic molecule
Emp. Form.:
C22H24BrNO2
Mol. Mass.:
414.335
SMILES:
CCN1CCC(=C(C1)C(=O)OCCc1ccc(Br)cc1)c1ccccc1
: