Target
Type-1 angiotensin II receptor
Ligand
BDBM50426776
Substrate
Meas. Tech.
ChEMBL_940612 (CHEMBL2327554)
IC50
7.0±n/a nM
Citation
 Casimiro-Garcia, AHeemstra, RJBigge, CFChen, JCiske, FADavis, JAEllis, TEsmaeil, NFlynn, DHan, SJalaie, MOhren, JFPowell, NA Design, synthesis, and evaluation of imidazo[4,5-c]pyridin-4-one derivatives with dual activity at angiotensin II type 1 receptor and peroxisome proliferator-activated receptor-¿. Bioorg Med Chem Lett 23:767-72 (2013)  
Target
Name:
Type-1 angiotensin II receptor
Synonyms:
AGTR1 AGTR1B AT1 AT1BR AT2R1B Angiotensin II receptor Type-1 angiotensin II receptor (AT1)
Type:
Protein
Mol. Mass.:
41080.75
Organism:
Homo sapiens (Human)
Description:
P30556
Residue:
359
  
Inhibitor
Name:
BDBM50426776
Synonyms:
CHEMBL2322176
Type:
Small organic molecule
Emp. Form.:
C33H28N8O
Mol. Mass.:
552.6284
SMILES:
CCc1nc2c(C)cn(Cc3ccccc3C#N)c(=O)c2n1[C@H]1CCc2cc(ccc12)-c1ccccc1-c1nnn[nH]1
: