Target
Sialidase-1
Ligand
BDBM50428073
Substrate
Meas. Tech.
ChEMBL_941622 (CHEMBL2330704)
IC50
>1000000±n/a nM
Citation
 Zhang, YAlbohy, AZou, YSmutova, VPshezhetsky, AVCairo, CW Identification of selective inhibitors for human neuraminidase isoenzymes using C4,C7-modified 2-deoxy-2,3-didehydro-N-acetylneuraminic acid (DANA) analogues. J Med Chem 56:2948-58 (2013)  
Target
Name:
Sialidase-1
Synonyms:
NANH NEUR1_HUMAN | Sialidase 1
Type:
PROTEIN
Mol. Mass.:
45463.28
Organism:
Homo sapiens (Human)
Description:
ChEMBL_960639
Residue:
415
  
Inhibitor
Name:
BDBM50428073
Synonyms:
CHEMBL2325809
Type:
Small organic molecule
Emp. Form.:
C15H17N5O4
Mol. Mass.:
331.3266
SMILES:
CC(=O)N[C@H]1[C@H](CNc2ccccc2)OC(=C[C@@H]1N=[N+]=[N-])C(O)=O
: