Target
Sialidase-4
Ligand
BDBM50428073
Substrate
Meas. Tech.
ChEMBL_941546 (CHEMBL2330586)
IC50
300000±n/a nM
Citation
 Zhang, YAlbohy, AZou, YSmutova, VPshezhetsky, AVCairo, CW Identification of selective inhibitors for human neuraminidase isoenzymes using C4,C7-modified 2-deoxy-2,3-didehydro-N-acetylneuraminic acid (DANA) analogues. J Med Chem 56:2948-58 (2013)  
Target
Name:
Sialidase-4
Synonyms:
NEU4 Sialidase 4
Type:
PROTEIN
Mol. Mass.:
51579.82
Organism:
Homo sapiens (Human)
Description:
ChEMBL_960637
Residue:
484
  
Inhibitor
Name:
BDBM50428073
Synonyms:
CHEMBL2325809
Type:
Small organic molecule
Emp. Form.:
C15H17N5O4
Mol. Mass.:
331.3266
SMILES:
CC(=O)N[C@H]1[C@H](CNc2ccccc2)OC(=C[C@@H]1N=[N+]=[N-])C(O)=O
: