Target
Beta-secretase 1
Ligand
BDBM50428343
Substrate
Meas. Tech.
ChEMBL_947399 (CHEMBL2345048)
IC50
5±n/a nM
Citation
 Blass, B Cyclopropyl-Fused 1,3-Thiazepines as BACE1 and BACE2 Inhibitors. ACS Med Chem Lett 4:379-80 (2013)  
Target
Name:
Beta-secretase 1
Synonyms:
ASP2 Aspartyl protease 2 BACE1 Beta-secretase (BACE) Beta-secretase 1 (BACE 1) Beta-secretase 1 (BACE1) Beta-site amyloid precursor protein cleaving enzyme 1 Memapsin-2 beta-Secretase (BACE-1) | beta-Secretase (BACE1)
Type:
Protein
Mol. Mass.:
55755.10
Organism:
Homo sapiens (Human)
Description:
P56817
Residue:
501
  
Inhibitor
Name:
BDBM50428343
Synonyms:
CHEMBL2331708
Type:
Small organic molecule
Emp. Form.:
C18H17ClN4OS
Mol. Mass.:
372.872
SMILES:
NC1=N[C@]2(C[C@H]2CCS1)c1cccc(NC(=O)c2ccc(Cl)cn2)c1
: