Target
Carbonic anhydrase 9
Ligand
BDBM50387159
Substrate
Meas. Tech.
ChEMBL_946060 (CHEMBL2342097)
Ki
14±n/a nM
Citation
 Tarko, LSupuran, CT QSAR studies of sulfamate and sulfamide inhibitors targeting human carbonic anhydrase isozymes I, II, IX and XII. Bioorg Med Chem 21:1404-9 (2013)  
Target
Name:
Carbonic anhydrase 9
Synonyms:
CA-IX CAH9_HUMAN Carbonic anhydrase 9 (CA IX) Carbonic anhydrase 9 precursor Carbonic anhydrase IX (CAIX) Carbonic anhydrases; II & IX MN RCC-associated antigen G250
Type:
Enzyme
Mol. Mass.:
49669.03
Organism:
Homo sapiens (Human)
Description:
Catalytic domain of human cloned isozyme was used in the assay
Residue:
459
  
Inhibitor
Name:
BDBM50387159
Synonyms:
4-ureidophenyl sulfamate ring derivative 3ax | CHEMBL2047840
Type:
Small organic molecule
Emp. Form.:
C19H19N3O4S
Mol. Mass.:
385.437
SMILES:
NS(=O)(=O)Oc1ccc(NC(=O)NCCc2cccc3ccccc23)cc1
: