Target
Peroxisome proliferator-activated receptor alpha
Ligand
BDBM50085042
Substrate
Meas. Tech.
ChEMBL_948912 (CHEMBL2341206)
EC50
33510±n/a nM
Citation
 Matin, ADoddareddy, MRGavande, NNammi, SGroundwater, PWRoubin, RHHibbs, DE The discovery of novel isoflavone pan peroxisome proliferator-activated receptor agonists. Bioorg Med Chem 21:766-78 (2013)  
Target
Name:
Peroxisome proliferator-activated receptor alpha
Synonyms:
NR1C1 PPAR PPAR-alpha PPARA_HUMAN Peroxisome proliferator-activated receptor | Peroxisome proliferator-activated receptor alpha (PPAR alpha)
Type:
Enzyme
Mol. Mass.:
52222.08
Organism:
Homo sapiens (Human)
Description:
Q07869
Residue:
468
  
Inhibitor
Name:
BDBM50085042
Synonyms:
2-(4-(4-Chlorobenzoyl)phenoxy)-2-methylpropanoic acid 1-methylethyl ester FENOFIBRATE Fenofibric acid Isopropyl (4'-(p-chlorobenzoyl)-2-phenoxy-2-methyl)propionate Lipantil (TN) Tricor (TN) | propan-2-yl 2-[4-(4-chlorobenzoyl)phenoxy]-2-methylpropanoate
Type:
Small organic molecule
Emp. Form.:
C20H21ClO4
Mol. Mass.:
360.831
SMILES:
CC(C)OC(=O)C(C)(C)Oc1ccc(cc1)C(=O)c1ccc(Cl)cc1
: