Target
Bifunctional epoxide hydrolase 2
Ligand
BDBM50000541
Substrate
Meas. Tech.
ChEMBL_948576 (CHEMBL2344666)
IC50
591±n/a nM
Citation
 Meirer, KRödl, CBWisniewska, JMGeorge, SHäfner, AKBuscató, ELKlingler, FMHahn, SBerressem, DWittmann, SKSteinhilber, DHofmann, BProschak, E Synthesis and structure-activity relationship studies of novel dual inhibitors of soluble epoxide hydrolase and 5-lipoxygenase. J Med Chem 56:1777-81 (2013)  
Target
Name:
Bifunctional epoxide hydrolase 2
Synonyms:
Cytosolic epoxide hydrolase 2 EPHX2 HYES_HUMAN Soluble epoxide hydrolase (sEH) | epoxide hydrolase 2, cytoplasmic
Type:
Enzyme
Mol. Mass.:
62613.07
Organism:
Homo sapiens (Human)
Description:
P34913
Residue:
555
  
Inhibitor
Name:
BDBM50000541
Synonyms:
(+-)-1-(1-Benzo[b]thien-2-ylethyl)-1-hydroxyurea CHEMBL93 N-(1-Benzo(b)thien-2-ylethyl)-N-hydroxyurea ZILEUTON | Zyflo (TN)
Type:
Small organic molecule
Emp. Form.:
C11H12N2O2S
Mol. Mass.:
236.29
SMILES:
CC(N(O)C(N)=O)c1cc2ccccc2s1
: