Target
Serine/threonine-protein kinase mTOR
Ligand
BDBM50348452
Substrate
Meas. Tech.
ChEMBL_948146 (CHEMBL2338832)
IC50
0.130000±n/a nM
Citation
 Pike, KGMalagu, KHummersone, MGMenear, KADuggan, HMGomez, SMartin, NMRuston, LPass, SLPass, M Optimization of potent and selective dual mTORC1 and mTORC2 inhibitors: the discovery of AZD8055 and AZD2014. Bioorg Med Chem Lett 23:1212-6 (2013)  
Target
Name:
Serine/threonine-protein kinase mTOR
Synonyms:
FK506-binding protein 12-rapamycin complex-associated protein 1 FRAP FRAP1 MTOR Mammalian Target of Rapamycin (mTOR) RAFT1 Rapamycin and FKBP12 target 1 Serine/threonine-protein kinase (mTOR) | mTORC2
Type:
Rapamycin target protein
Mol. Mass.:
288917.12
Organism:
Homo sapiens (Human)
Description:
P42345
Residue:
2549
  
Inhibitor
Name:
BDBM50348452
Synonyms:
AZD-8055 US9102670, 1a
Type:
Small organic molecule
Emp. Form.:
C25H31N5O4
Mol. Mass.:
465.5447
SMILES:
COc1ccc(cc1CO)-c1ccc2c(nc(nc2n1)N1CCOC[C@@H]1C)N1CCOC[C@@H]1C
: