Target
Matrix metalloproteinase-9
Ligand
BDBM50429759
Substrate
Meas. Tech.
ChEMBL_948150 (CHEMBL2338836)
IC50
7.4±n/a nM
Citation
 Shi, ZHLi, NGShi, QPTang, HTang, YPLi, WYin, LYang, JPDuan, JA Synthesis and structure-activity relationship analysis of caffeic acid amides as selective matrix metalloproteinase inhibitors. Bioorg Med Chem Lett 23:1206-11 (2013)  
Target
Name:
Matrix metalloproteinase-9
Synonyms:
67 kDa matrix metalloproteinase-9 92 kDa gelatinase CLG4B Gelatinase B MMP9 Matrix metalloproteinase 9 (MMP-9) Matrix metalloproteinase-9 (MMP9)
Type:
Enzyme
Mol. Mass.:
78452.28
Organism:
Homo sapiens (Human)
Description:
P14780
Residue:
707
  
Inhibitor
Name:
BDBM50429759
Synonyms:
CHEMBL2336358 | N-O-Tolylcinnamamide
Type:
Small organic molecule
Emp. Form.:
C16H15NO
Mol. Mass.:
237.2964
SMILES:
Cc1ccccc1NC(=O)\C=C\c1ccccc1
: