Target
A disintegrin and metalloproteinase with thrombospondin motifs 5
Ligand
BDBM50104963
Substrate
Meas. Tech.
ChEMBL_948655 (CHEMBL2345605)
IC50
17±n/a nM
Citation
 Nuti, ESantamaria, SCasalini, FYamamoto, KMarinelli, LLa Pietra, VNovellino, EOrlandini, ENencetti, SMarini, AMSalerno, STaliani, SDa Settimo, FNagase, HRossello, A Arylsulfonamide inhibitors of aggrecanases as potential therapeutic agents for osteoarthritis: synthesis and biological evaluation. Eur J Med Chem 62:379-94 (2013)  
Target
Name:
A disintegrin and metalloproteinase with thrombospondin motifs 5
Synonyms:
A disintegrin and metalloproteinase with thrombospondin motifs 5 (ADAMTS-5) ADAMTS5 ATS5_HUMAN Metalloproteinase with thrombospondin motifs 5 (ADAMTS-5)
Type:
Enzyme
Mol. Mass.:
101769.09
Organism:
Homo sapiens (Human)
Description:
Q9UNA0
Residue:
930
  
Inhibitor
Name:
BDBM50104963
Synonyms:
(2S,3R)-2-(cyclopropylmethylamino)-N1-hydroxy-N4-((1S,2R)-2-hydroxy-2,3-dihydro-1H-inden-1-yl)-3-(3-hydroxybenzyl)succinamide (R)-2-(Cyclopropylmethyl-amino)-N*1*-hydroxy-3-(3-hydroxy-benzyl)-N*4*-((3S,3aR)-2-hydroxy-indan-1-yl)-succinamide CHEMBL24398
Type:
Small organic molecule
Emp. Form.:
C24H29N3O5
Mol. Mass.:
439.5042
SMILES:
ONC(=O)[C@@H](NCC1CC1)[C@@H](Cc1cccc(O)c1)C(=O)N[C@@H]1[C@H](O)Cc2ccccc12
: