Target
Collagenase 3
Ligand
BDBM50429818
Substrate
Meas. Tech.
ChEMBL_948652 (CHEMBL2345602)
IC50
19±n/a nM
Citation
 Nuti, ESantamaria, SCasalini, FYamamoto, KMarinelli, LLa Pietra, VNovellino, EOrlandini, ENencetti, SMarini, AMSalerno, STaliani, SDa Settimo, FNagase, HRossello, A Arylsulfonamide inhibitors of aggrecanases as potential therapeutic agents for osteoarthritis: synthesis and biological evaluation. Eur J Med Chem 62:379-94 (2013)  
Target
Name:
Collagenase 3
Synonyms:
MMP-13 MMP13_HUMAN Matrix metalloproteinase-13 (MMP-13) | Matrix metalloproteinase-13 (MMP13)
Type:
Enzyme
Mol. Mass.:
53808.06
Organism:
Homo sapiens (Human)
Description:
P45452
Residue:
471
  
Inhibitor
Name:
BDBM50429818
Synonyms:
CHEMBL2337691
Type:
Small organic molecule
Emp. Form.:
C15H16N2O5S
Mol. Mass.:
336.363
SMILES:
ONC(=O)CNS(=O)(=O)c1ccc(OCc2ccccc2)cc1
: