Target
72 kDa type IV collagenase
Ligand
BDBM50429815
Substrate
Meas. Tech.
ChEMBL_948653 (CHEMBL2345603)
IC50
46±n/a nM
Citation
 Nuti, ESantamaria, SCasalini, FYamamoto, KMarinelli, LLa Pietra, VNovellino, EOrlandini, ENencetti, SMarini, AMSalerno, STaliani, SDa Settimo, FNagase, HRossello, A Arylsulfonamide inhibitors of aggrecanases as potential therapeutic agents for osteoarthritis: synthesis and biological evaluation. Eur J Med Chem 62:379-94 (2013)  
Target
Name:
72 kDa type IV collagenase
Synonyms:
72 kDa gelatinase CLG4A Gelatinase A (MMP-2) MMP2_HUMAN Matrix metalloproteinase-2 (MMP 2) Matrix metalloproteinases 2 (MMP-2) | TBE-1
Type:
Enzyme
Mol. Mass.:
73870.36
Organism:
Homo sapiens (Human)
Description:
P08253
Residue:
660
  
Inhibitor
Name:
BDBM50429815
Synonyms:
CHEMBL2337698
Type:
Small organic molecule
Emp. Form.:
C15H14ClFN2O5S
Mol. Mass.:
388.798
SMILES:
ONC(=O)CNS(=O)(=O)c1ccc(OCc2ccc(F)cc2Cl)cc1
: